[Zope-tests] FAILED (failures=1) : Zope-2.11 Python-2.4.4 : Linux

Zope Tests zope-tests at epy.co.at
Sat Sep 13 20:57:15 EDT 2008

Zope Tests : FAILED (failures=1)
Zope-2.11 Python-2.4.4 : Linux

Running /usr/local/python2.4/bin/python test.py -q --all
Running unit tests:

Failure in test test_handle_error (ZServer.tests.test_clockserver.ClockServerTests)
Traceback (most recent call last):
  File "/usr/local/python2.4/lib/python2.4/unittest.py", line 260, in run
  File "/home/stefan/autotest/temp/python24-zope211/lib/python/ZServer/tests/test_clockserver.py", line 103, in test_handle_error
    self.assertRaises(AssertionError, server.handle_error)
  File "/usr/local/python2.4/lib/python2.4/unittest.py", line 326, in failUnlessRaises
    raise self.failureException, "%s not raised" % excName
AssertionError: AssertionError not raised

The following test left new threads behind:
testABOR (zope.server.ftp.tests.test_ftpserver.Tests)
New thread(s): [<_DummyThread(Dummy-36, started daemon)>]
  Ran 5834 tests with 1 failures and 0 errors in 3 minutes 25.460 seconds.
Running OFS.tests.testCopySupportEvents.EventLayer tests:
  Set up OFS.tests.testCopySupportEvents.EventLayer in 0.566 seconds.
  Ran 14 tests with 0 failures and 0 errors in 0.159 seconds.
Running Testing.ZopeTestCase.layer.ZopeLite tests:
  Tear down OFS.tests.testCopySupportEvents.EventLayer in 0.006 seconds.
  Set up Testing.ZopeTestCase.layer.ZopeLite in 0.000 seconds.
  Ran 673 tests with 0 failures and 0 errors in 27.699 seconds.
Running Testing.ZopeTestCase.testShoppingCart.ShoppingCartLayer tests:
  Set up Testing.ZopeTestCase.testShoppingCart.ShoppingCartLayer in 0.229 seconds.
  Ran 16 tests with 0 failures and 0 errors in 0.491 seconds.
Running Testing.ZopeTestCase.testZODBCompat.ZODBCompatLayer tests:
  Tear down Testing.ZopeTestCase.testShoppingCart.ShoppingCartLayer in 0.004 seconds.
  Set up Testing.ZopeTestCase.testZODBCompat.ZODBCompatLayer in 0.004 seconds.
  Ran 18 tests with 0 failures and 0 errors in 0.121 seconds.
Running Testing.ZopeTestCase.zopedoctest.testLayerExtraction.TestLayer tests:
  Tear down Testing.ZopeTestCase.testZODBCompat.ZODBCompatLayer in 0.004 seconds.
  Set up Testing.ZopeTestCase.zopedoctest.testLayerExtraction.TestLayer in 0.003 seconds.
  Ran 2 tests with 0 failures and 0 errors in 0.021 seconds.
Running zope.formlib.tests.FormlibLayer tests:
  Tear down Testing.ZopeTestCase.zopedoctest.testLayerExtraction.TestLayer in 0.003 seconds.
  Tear down Testing.ZopeTestCase.layer.ZopeLite in 0.000 seconds.
  Set up zope.formlib.tests.FormlibLayer in 1.971 seconds.
  Ran 5 tests with 0 failures and 0 errors in 0.014 seconds.
Running zope.testbrowser.tests.TestBrowserLayer tests:
  Tear down zope.formlib.tests.FormlibLayer in 0.008 seconds.
  Set up zope.testbrowser.tests.TestBrowserLayer in 1.406 seconds.
  Ran 108 tests with 0 failures and 0 errors in 2.703 seconds.
Running zope.traversing.tests.layer.TraversingLayer tests:
  Tear down zope.testbrowser.tests.TestBrowserLayer in 0.008 seconds.
  Set up zope.traversing.tests.layer.TraversingLayer in 1.285 seconds.
  Ran 7 tests with 0 failures and 0 errors in 0.460 seconds.
Tearing down left over layers:
  Tear down zope.traversing.tests.layer.TraversingLayer in 0.008 seconds.
Total: 6677 tests, 1 failures, 0 errors in 48.625 seconds.

FAILED (failures=1)

More information about the Zope-tests mailing list